Ready to version 1.5.0

4 jobs for v1.5.0 in 1 minute and 56 seconds (queued for 1 minute and 18 seconds)
latest
Status Job ID Name Coverage
  Build Testinstall
failed #251836
dailyBuildMasterAll

00:01:56

 
  Doc Coverage
skipped #251840
Doc
skipped #251838
TestCoverage
 
  Deploy
skipped #251842
pages
 
Name Stage Failure
failed
dailyBuildMasterAll Build Testinstall
/builds/CTA-LAPP/PHOENIX_LIBS/ParserGenerator/.tmp_project/OptionParser/.tmp_project/StringUtils/TESTS/TEST_ERASE_FIRST_LAST_CHARS/main.cpp:101:1: fatal error: error writing to /tmp/cchFUyhg.s: No space left on device
101 | }
| ^
compilation terminated.
make[2]: *** [.tmp_project/OptionParser/.tmp_project/StringUtils/TESTS/TEST_ERASE_FIRST_LAST_CHARS/CMakeFiles/test_erase_first_last_chars.dir/build.make:63: .tmp_project/OptionParser/.tmp_project/StringUtils/TESTS/TEST_ERASE_FIRST_LAST_CHARS/CMakeFiles/test_erase_first_last_chars.dir/main.cpp.o] Error 1
make[1]: *** [CMakeFiles/Makefile2:2581: .tmp_project/OptionParser/.tmp_project/StringUtils/TESTS/TEST_ERASE_FIRST_LAST_CHARS/CMakeFiles/test_erase_first_last_chars.dir/all] Error 2
make: *** [Makefile:163: all] Error 2
Cleaning up file based variables
ERROR: Job failed: exit code 1