Ready to version 1.5.0

4 jobs for v1.5.0 in 5 minutes and 51 seconds (queued for 2 seconds)
latest
Status Job ID Name Coverage
  Build Testinstall
passed #251801
dailyBuildMasterAll

00:04:11

 
  Doc Coverage
failed #251803
Doc

00:01:26

failed #251802
TestCoverage

00:01:40

 
  Deploy
skipped #251804
pages
 
Name Stage Failure
failed
TestCoverage Doc Coverage
/builds/CTA-LAPP/PHOENIX_LIBS/PhoenixFileGenerator/.tmp_project/PhoenixGenerator/.tmp_project/StringUtils/TESTS/TEST_CONVERT_TO_STRING/main.cpp:57:1: fatal error: error writing to /tmp/ccHD83O4.s: No space left on device
57 | }
| ^
compilation terminated.
make[2]: *** [.tmp_project/PhoenixGenerator/.tmp_project/StringUtils/TESTS/TEST_CONVERT_TO_STRING/CMakeFiles/test_convert_to_string.dir/build.make:63: .tmp_project/PhoenixGenerator/.tmp_project/StringUtils/TESTS/TEST_CONVERT_TO_STRING/CMakeFiles/test_convert_to_string.dir/main.cpp.o] Error 1
make[1]: *** [CMakeFiles/Makefile2:2234: .tmp_project/PhoenixGenerator/.tmp_project/StringUtils/TESTS/TEST_CONVERT_TO_STRING/CMakeFiles/test_convert_to_string.dir/all] Error 2
make: *** [Makefile:163: all] Error 2
Cleaning up file based variables
ERROR: Job failed: exit code 1
failed
Doc Doc Coverage
Running on runner-fxoaw2ya-project-11438-concurrent-1 via ccosvms0006...
Getting source from Git repository
Fetching changes with git depth set to 50...
Initialized empty Git repository in /builds/CTA-LAPP/PHOENIX_LIBS/PhoenixFileGenerator/.git/
Created fresh repository.
fatal: cannot write keep file '.git/objects/pack/pack-98501443b5c016f33b5928c5cb89fbf15c46a6aa.keep': No space left on device
fatal: index-pack failed
Cleaning up file based variables
ERROR: Job failed: exit code 1