📣 An issue occured with the embedded container registry on October 25 2021, between 10:30 and 12:10 (UTC+2). Any persisting issues should be reported to CC-IN2P3 Support. 🐛

Ready to version 1.5.0

4 jobs for v1.5.0 in 2 minutes and 42 seconds (queued for 33 seconds)
latest
Status Job ID Name Coverage
  Build Testinstall
failed #251818
dailyBuildMasterAll

00:02:42

 
  Doc Coverage
skipped #251821
Doc
skipped #251820
TestCoverage
 
  Deploy
skipped #251822
pages
 
Name Stage Failure
failed
dailyBuildMasterAll Build Testinstall
Scanning dependencies of target test_plib_dico_value
[ 35%] Building CXX object .tmp_project/FileParser/TESTS/TEST_DICO_VALUE/CMakeFiles/test_plib_dico_value.dir/main.cpp.o
Assembler messages:
Fatal error: can't create CMakeFiles/test_plib_dico_value.dir/main.cpp.o: No space left on device
make[2]: *** [.tmp_project/FileParser/TESTS/TEST_DICO_VALUE/CMakeFiles/test_plib_dico_value.dir/build.make:63: .tmp_project/FileParser/TESTS/TEST_DICO_VALUE/CMakeFiles/test_plib_dico_value.dir/main.cpp.o] Error 1
make[1]: *** [CMakeFiles/Makefile2:3545: .tmp_project/FileParser/TESTS/TEST_DICO_VALUE/CMakeFiles/test_plib_dico_value.dir/all] Error 2
make: *** [Makefile:163: all] Error 2
Cleaning up file based variables
ERROR: Job failed: exit code 1